文档章节

Maven常见异常及解决方法

F
 FullLover
发布于 2016/09/27 18:05
字数 572
阅读 21
收藏 0

异常1:

[ERROR] Failed to execute goal on project biz_zhuhai: Could not resolve dependencies for project biz_zhuhai:biz_zhuhai:jar:0.0.1-SNAPSHOT: Failed to collect dependencies for [com.maywide.ibh:lib345:pom:1.0 (compile)]: Failed to read artifact descriptor for com.maywide.ibh:lib345:pom:1.0: Could not transfer artifact com.maywide.ibh:lib345:pom:1.0 from/to releases (http://localhost:9888/nexus-2.0.3/content/repositories/releases): Connection to http://localhost:9888 refused: Connection refused: connect -> [Help 1]

解决方法:

这是配置的url有错误或者是私服没有配好,导致构件下载时出错。如果没有jar包需要在私服里下载,可以不配置私服的,也就是可以把setting.xml的profiles里的东西全部删除的。

异常2:

[ERROR] Failed to execute goal org.apache.maven.plugins:maven-surefire-plugin:2.10:test (default-test) on project web_nanchang: There are test failures.

[ERROR]

[ERROR] Please refer to E:\maven\web_nanchang\target\surefire-reports for the individual test results.

解决方法:

这是因为测试代码时遇到错误,它会停止编译。只需要在pom.xml的<project>里添加以下配置,使得测试出错不影响项目的编译。

<build> <plugins> <plugin> <groupId>org.apache.maven.plugins</groupId> <artifactId>maven-surefire-plugin</artifactId> <configuration> <testFailureIgnore>true</testFailureIgnore> </configuration> </plugin> </plugins> </build>

异常3:

[ERROR] Failed to execute goal org.codehaus.cargo:cargo-maven2-plugin:1.0.6:start (start-container) on project myproject: Execution start-container of goal org.codehaus.cargo:cargo-maven2-plugin:1.0.6:start failed: Error while expanding C:\DOCUME~1\ADMINI~1\LOCALS~1\Temp\cargo\installs\apache-tomcat-6.0.29.zip [ERROR] java.io.IOException: Negative seek offset [ERROR] -> [Help 1] [ERROR] [ERROR] To see the full stack trace of the errors, re-run Maven with the -e swit ch. [ERROR] Re-run Maven using the -X switch to enable full debug logging. [ERROR] [ERROR] For more information about the errors and possible solutions, please rea d the following articles: [ERROR] [Help 1] http://cwiki.apache.org/confluence/display/MAVEN/PluginExecutio nException

解决方法:

自己下载“apache-tomcat-6.0.29.zip”,将下载好的文件拷贝到指定文件夹“C:\Documents and Settings\Administrator\Local Settings\Temp\cargo\installs”下。

异常4:

[ERROR] Failed to execute goal org.apache.maven.plugins:maven-war-plugin:2.1.1:war (default-war) on project web_nanchang: Error assembling WAR: webxml attribute is required (or pre-existing WEB-INF/web.xml if executing in update mode) -> [Help 1]

[ERROR]

[ERROR] To see the full stack trace of the errors, re-run Maven with the -e switch.

[ERROR] Re-run Maven using the -X switch to enable full debug logging.

[ERROR]

[ERROR] For more information about the errors and possible solutions, please read the following articles:

解决方法:

maven的web项目默认的webroot是在src\main\webapp。如果在此目录下找不到web.xml就抛出以上的异常。解决方法在pom.xml加入以下的配置。红色字体改成你网站的根目录。

<build> <finalName>simple-webapp</finalName> <plugins> <plugin> <groupId>org.apache.maven.plugins</groupId> <artifactId>maven-war-plugin</artifactId> <version>2.1.1</version> <configuration> <webResources> <resource> <!-- this is relative to the pom.xml directory --> <directory>WebContent</directory> </resource> </webResources> </configuration> </plugin> </plugins> </build>

© 著作权归作者所有

F
粉丝 0
博文 4
码字总数 3065
作品 0
郑州
私信 提问
maven使用中的常见异常问题整理

结合网络大神提供的异常错误,及加上自身开发中时常遇到的一些问题,汇总到博客中,如有问题,谢谢提议; Maven使用常见问题整理 1、更新eclipse的classpath加入新依赖 1、在dependencyManagemen...

尾生
2016/11/28
156
0
【maven】java.lang.ClassNotFoundException

项目背景: 使用maven创建的java web项目,yongmaven管理依赖。 异常描述: 异常分析: class没有找到导致的异常,没有相关的jar 异常解决: 部署项目到tomcat中后,到部署目录下查看了下,果...

666B
2014/06/29
5.3K
0
Maven异常_06_ Unknown lifecycle phase "mvn"

一、异常现象 在eclipse中执行以下maven命令 时, mvn spring-boot:run 报出如下错误: Unknown lifecycle phase "mvn" 二、异常原因 当我们在eclipse中执行maven命令时,不需要加mvn; 三、...

rayner
2017/11/28
0
0
java.nio.BufferOverflowException

Bug ID: 6526175 Votes 0 Synopsis Compiler throws BufferOverflowException should say that it ran out of memory Category java:compiler Reported Against Release Fixed State Priorit......

付翔
2010/06/29
0
0
spring集成Junit做单元测试及常见异常解决办法

spring-test依赖包   org.springframework  spring-test  4.3.7.RELEASE 1、简

孤城孤刀
2018/08/06
0
0

没有更多内容

加载失败,请刷新页面

加载更多

SpringBoot中 集成 redisTemplate 对 Redis 的操作(二)

SpringBoot中 集成 redisTemplate 对 Redis 的操作(二) List 类型的操作 1、 向列表左侧添加数据 Long leftPush = redisTemplate.opsForList().leftPush("name", name); 2、 向列表右......

TcWong
今天
4
0
排序––快速排序(二)

根据排序––快速排序(一)的描述,现准备写一个快速排序的主体框架: 1、首先需要设置一个枢轴元素即setPivot(int i); 2、然后需要与枢轴元素进行比较即int comparePivot(int j); 3、最后...

FAT_mt
昨天
4
0
mysql概览

学习知识,首先要有一个总体的认识。以下为mysql概览 1-架构图 2-Detail csdn |简书 | 头条 | SegmentFault 思否 | 掘金 | 开源中国 |

程序员深夜写bug
昨天
10
0
golang微服务框架go-micro 入门笔记2.2 micro工具之微应用利器micro web

micro web micro 功能非常强大,本文将详细阐述micro web 命令行的功能 阅读本文前你可能需要进行如下知识储备 golang分布式微服务框架go-micro 入门笔记1:搭建go-micro环境, golang微服务框架...

非正式解决方案
昨天
7
0
前端——使用base64编码在页面嵌入图片

因为页面中插入一个图片都要写明图片的路径——相对路径或者绝对路径。而除了具体的网站图片的图片地址,如果是在自己电脑文件夹里的图片,当我们的HTML文件在别人电脑上打开的时候图片则由于...

被毒打的程序猿
昨天
9
0

没有更多内容

加载失败,请刷新页面

加载更多

返回顶部
顶部