文档章节

Error:Execution failed for task ':app:transformRes

丁佳辉
 丁佳辉
发布于 2016/06/22 16:11
字数 153
阅读 22
收藏 0

今天用上Android Studio2.0正式版,编译项目后出现如下错误: [plain] view plain copy 在CODE上查看代码片派生到我的代码片 Error:Execution failed for task ':app:transformResourcesWithMergeJavaResForUmengDebug'.

com.android.build.api.transform.TransformException: com.android.builder.packaging.DuplicateFileException: Duplicate files copied in APK META-INF/maven/com.belerweb/pinyin4j/pom.properties
File1: C:\Users\CYM.gradle\caches\modules-2\files-2.1\com.belerweb\pinyin4j\2.5.0\5a620aedec0f779f2123ba60fd4b74bfbd3e2646\pinyin4j-2.5.0.jar
File2: C:\Users\CYM.gradle\caches\modules-2\files-2.1\com.belerweb\pinyin4j\2.5.0\5a620aedec0f779f2123ba60fd4b74bfbd3e2646\pinyin4j-2.5.0.jar

解决办法如下: 在build.grade里的android里添加: [plain] view plain copy 在CODE上查看代码片派生到我的代码片 packagingOptions {
exclude 'META-INF/maven/com.belerweb/pinyin4j/pom.xml'
exclude 'META-INF/maven/com.belerweb/pinyin4j/pom.properties'
}

查考:http://unix8.net/home.php/category/android

本文转载自:http://blog.csdn.net/hmyang314/article/details/51250551

丁佳辉
粉丝 20
博文 446
码字总数 203356
作品 0
浦东
程序员
私信 提问
error:execution failed for task ':app:transformclasseswithdexfordebug'. > co

3个错误non-zero exit value 1; non-zero exit value 2; non-zero exit value 3 Error:Execution failed for task ':app:transformClassesWithDexForDebug'. com.Android.build.api.transf......

星雨gg
2016/09/29
34
0
昨天折腾了一天 Android Studio 遇见的问题记录

`Error:Execution failed for task ':app:transformResourcesWithMergeJavaResForDebug'.> com.android.build.api.transform.TransformException: com.android.builder.packaging.DuplicateF......

Nobodyhi
2017/01/01
2
0
Error:Execution failed for task ':app:compileDebugJavaWithJavac'.

Error:Execution failed for task ':app:compileDebugJavaWithJavac'. > java.io.FileNotFoundException: /Users/macbookair/AndroidStudioProjects/TrackDating/app/libs/AMap_Location_V2.......

rjtc2020
2016/09/11
12.5K
2
cordova android build FAILED

下面的命令也许可以治好: 参考: https://cordova.apache.org/docs/en/latest/reference/cordova-cli/index.html#cordova-clean-command...

郭大鹏
2018/04/16
372
0
Android studio遇到的一些小问题

前言:在Android开发过程中,经常都会遇到一些莫名的错误提示,所以我就把遇到过的问题都记录下来了,需要下次再遇到的话就能第一时间解决问题! 一、Error running app: Instant Run requir...

zsml2016
2017/10/21
0
0

没有更多内容

加载失败,请刷新页面

加载更多

OSChina 周六乱弹 —— 早上儿子问我他是怎么来的

Osc乱弹歌单(2019)请戳(这里) 【今日歌曲】 @凉小生 :#今日歌曲推荐# 少点戾气,愿你和这个世界温柔以待。中岛美嘉的单曲《僕が死のうと思ったのは (曾经我也想过一了百了)》 《僕が死の...

小小编辑
今天
202
4
Excption与Error包结构,OOM 你遇到过哪些情况,SOF 你遇到过哪些情况

Throwable 是 Java 中所有错误与异常的超类,Throwable 包含两个子类,Error 与 Exception 。用于指示发生了异常情况。 Java 抛出的 Throwable 可以分成三种类型。 被检查异常(checked Exc...

Garphy
今天
10
0
计算机实现原理专题--二进制减法器(二)

在计算机实现原理专题--二进制减法器(一)中说明了基本原理,现准备说明如何来实现。 首先第一步255-b运算相当于对b进行按位取反,因此可将8个非门组成如下图的形式: 由于每次做减法时,我...

FAT_mt
昨天
6
0
好程序员大数据学习路线分享函数+map映射+元祖

好程序员大数据学习路线分享函数+map映射+元祖,大数据各个平台上的语言实现 hadoop 由java实现,2003年至今,三大块:数据处理,数据存储,数据计算 存储: hbase --> 数据成表 处理: hive --> 数...

好程序员官方
昨天
7
0
tabel 中含有复选框的列 数据理解

1、el-ui中实现某一列为复选框 实现多选非常简单: 手动添加一个el-table-column,设type属性为selction即可; 2、@selection-change事件:选项发生勾选状态变化时触发该事件 <el-table @sel...

everthing
昨天
6
0

没有更多内容

加载失败,请刷新页面

加载更多

返回顶部
顶部