文档章节

解决 Error: ENOENT: no such file or directory, scandir '..\node_modules\node-sass\vendor'

JamesView
 JamesView
发布于 2017/09/06 09:59
字数 241
阅读 101
收藏 0
Module build failed: Error: ENOENT: no such file or directory, scandir 'D:\www\第三方Demo\vue2.0-demos\node_modules\node-sass\vendor'
    at Object.fs.readdirSync (fs.js:896:18)
    at Object.getInstalledBinaries (D:\www\第三方Demo\vue2.0-demos\node_modules\node-sass\lib\extensions.js:124:13)
    at foundBinariesList (D:\www\第三方Demo\vue2.0-demos\node_modules\node-sass\lib\errors.js:20:15)
    at foundBinaries (D:\www\第三方Demo\vue2.0-demos\node_modules\node-sass\lib\errors.js:15:5)
    at Object.module.exports.missingBinary (D:\www\第三方Demo\vue2.0-demos\node_modules\node-sass\lib\errors.js:45:5)
    at module.exports (D:\www\第三方Demo\vue2.0-demos\node_modules\node-sass\lib\binding.js:15:30)
    at Object.<anonymous> (D:\www\第三方Demo\vue2.0-demos\node_modules\node-sass\lib\index.js:14:35)
    at Module._compile (module.js:569:30)
    at Object.Module._extensions..js (module.js:580:10)
    at Module.load (module.js:503:32)
    at tryModuleLoad (module.js:466:12)
    at Function.Module._load (module.js:458:3)
    at Module.require (module.js:513:17)
    at require (internal/module.js:11:18)
    at Object.<anonymous> (D:\www\第三方Demo\vue2.0-demos\node_modules\sass-loader\lib\loader.js:3:14)
    at Module._compile (module.js:569:30)

解决方法:
npm rebuild node-sass

原理:经测试后得出...

© 著作权归作者所有

共有 人打赏支持
JamesView
粉丝 6
博文 87
码字总数 17760
作品 0
海淀
前端工程师
ionic2升级到3报错

ionic2升级到3,终端输入sudo npm update -g cordova ionic 出现如下警告和错误 npm WARN checkPermissions Missing write access to /usr/local/lib/nodemodules/ionic/nodemodules/@ionic/......

mysticwe
2017/06/23
170
1
Error: ENOENT: no such file or directory, open node_modules/electron/path.txt

在尝试Electron过程中出现找不到path.txt错误: 解决: 再看一下electron目录下面,有了path.txt

xcxv
2016/12/14
53
0
node.js install 报错

no permission 给该目录赋值权限 chmod -R 777 目录 2) no such file or directory, scandir 安装node-sass报错 运行 npm rebuild node-sass...

sendo
04/02
0
0
npm install express 报错:no such file or directory

Upgrading... Error: npm Error: WARN ENOENT ENOENT: no such file or directory, open 'C:Program Filesnodejspackage.json' Error: npm Error: WARN EPACKAGEJSON nodejs No description ......

china008
2015/12/30
677
0
no files to open pakgejson

npm ERR! Windows_NT 10.0.10586 npm ERR! argv "C:\Program Files\nodejs\node.exe" "C:\Users\windows\AppData\Roaming\npm\node_modules\npm\bin\npm-cli.js" "start" npm ERR! node v4.4......

jiushu
2016/08/11
97
1

没有更多内容

加载失败,请刷新页面

加载更多

初级开发-编程题

` public static void main(String[] args) { System.out.println(changeStrToUpperCase("user_name_abc")); System.out.println(changeStrToLowerCase(changeStrToUpperCase("user_name_abc......

小池仔
22分钟前
0
0
现场看路演了!

HiBlock
昨天
4
0
Rabbit MQ基本概念介绍

RabbitMQ介绍 • RabbitMQ是一个消息中间件,是一个很好用的消息队列框架。 • ConnectionFactory、Connection、Channel都是RabbitMQ对外提供的API中最基本的对象。Connection是RabbitMQ的s...

寰宇01
昨天
4
0
官方精简版Windows10:微软自己都看不过去了

微软宣布,该公司正在寻求解决方案,以减轻企业客户的Windows 10规模。该公司声称,企业客户下载整个Windows 10文件以更新设备既费钱又费时。 微软宣布,该公司正在寻求解决方案,以减轻企业...

linux-tao
昨天
4
0
TypeScript基础入门之JSX(二)

转发 TypeScript基础入门之JSX(二) 属性类型检查 键入检查属性的第一步是确定元素属性类型。 内在元素和基于价值的元素之间略有不同。 对于内部元素,它是JSX.IntrinsicElements上的属性类型...

durban
昨天
6
0

没有更多内容

加载失败,请刷新页面

加载更多

返回顶部
顶部