文档章节

Android 错误:Installation error: INSTALL_FAILED_V

DouDouLee
 DouDouLee
发布于 2016/05/22 12:16
字数 40
阅读 16
收藏 2
点赞 2
评论 0

Android 错误: Installation error: INSTALL_FAILED_VERSION_DOWNGRADE resolution: 提高版本号 提高 AndroidManifest.xml中的manifest的android:versionCode

<manifest xmlns:android="http://schemas.android.com/apk/res/android" package="sunny.example.openhtmlimage" android:versionCode="21" >

© 著作权归作者所有

共有 人打赏支持
DouDouLee
粉丝 6
博文 91
码字总数 45242
作品 0
西安
Android Studio 3.2 Canary 17 和 3.1.3 bugfix 版发布

Android Studio 发布了 3.2 Canary 17 和 3.1.3 bug-fix 版本。 Android Studio 3.1.3 bug-fix Memory leaks caused Android Studio to become slow and unresponsive after you had been u......

局长 ⋅ 06/08 ⋅ 0

Gradle/Studio构建问题(Ant/Gradle)

> 使用Gradle遇到的问题及其他: Android Studio安装过程常见问题图解-- http://jingyan.baidu.com/article/fd8044fad5bdca5031137ab7.html 1. 将GitHub上的新项目导入Studio中 Pano360-mast......

shareus ⋅ 05/11 ⋅ 0

9种常见的Android开发错误及解决方案

整理总结了9个Android开发中的错误以及解决方案,共同探讨进步! 1. 如果你的项目的R文件不见的话,可以试下改版本号在保存,R文件不见一般都是布局文本出错导致. 2. 布局文件不可以有大写字母...

拉偶有所依 ⋅ 2015/01/21 ⋅ 0

cordova打包问题,Execution failed for task ':processDebugResources'.

运行cordova run android 或者cordova build android都会有下面的错误与,请问这个怎么解决呢? --------------------------------------------------------------------------------------......

茗香墨语 ⋅ 05/30 ⋅ 0

用Android Studio进行NDK编程入门实例

参考了网上各种教程,跌跌撞撞最终才把流程走通,特此记录一下: 有必要先交代下开发环境: 操作系统:Win7 Android Studio 3.0.1 gradle 3.0.1 首先,新建一个Android项目,然后在MainActiv...

analogous_love ⋅ 04/17 ⋅ 0

cordova android build FAILED

下面的命令也许可以治好: 参考: https://cordova.apache.org/docs/en/latest/reference/cordova-cli/index.html#cordova-clean-command...

郭大鹏 ⋅ 04/16 ⋅ 0

android开发中eclipse容易出现的问题

搞过android开发的人应该都有遇到eclipse装怪的时候吧,反正我有几次就想扔砖头砸电脑。下面是我遇到的几个常见的问题: 1:ADB server didn't ACK failed to start daemon ,这个是我遇到过...

我不是咸蛋 ⋅ 2012/08/30 ⋅ 1

写android简易播放音乐遇到的问题

在android模拟器中开发简易的音乐播放器是遇到了两个问题: 1, 启动模拟器时发生Installation error: INSTALLFAILEDINSUFFICIENT_STORAGE 2, 即使先prepare()后start(),依然不能正常播放音乐...

找寻 ⋅ 2011/07/03 ⋅ 1

Device is not certified by Google

错误警报: Developer warning for package "com.google.android.googlequicksearchbox" Failed to post notification on channel "null" See log for more details 错误原因: Google 为了加强......

注定分享 ⋅ 05/02 ⋅ 0

React Native 调试问题

使用React Native Tool在VSCODE中进行断点调试时点击DEBUG Android,弹出 Could not debug. Unknown error: not all success patterns were matched. It means that "react-native run-andro......

bill1987610 ⋅ 05/31 ⋅ 0

没有更多内容

加载失败,请刷新页面

加载更多

下一页

Boost库编译应用

版本:Boost 1.66.0 Windows库编译 官网指南:直接执行bootstrap.bat处理文件即可,可以我却遇到一堆的问题。 环境:Windows 10 + Visual Studio 2017 Boost编译出来库命名 boost库生成文件命...

水海云 ⋅ 31分钟前 ⋅ 0

解决Eclipse发布到Tomcat丢失依赖jar包的问题

如果jar文件是以外部依赖的形式导入的。Eclipse将web项目发布到Tomcat时,是不会自动发布这些依赖的。 可以通过Eclipse在项目上右击 - Propertics - Deployment Assembly,添加“Java Build ...

ArlenXu ⋅ 31分钟前 ⋅ 0

iview tree组件层级过多时可左右滚动

使用vue+iview的tree组件,iview官网iview的tree树形控件 问题描述:tree层级过多时左右不可滚动 问题解决:修改overflow属性值 .el-tree-node>.el-tree-node_children { overflow: vi...

YXMBetter ⋅ 33分钟前 ⋅ 0

分布式锁

1.通过数据库实现 http://www.weizijun.cn/2016/03/17/%E8%81%8A%E4%B8%80%E8%81%8A%E5%88%86%E5%B8%83%E5%BC%8F%E9%94%81%E7%9A%84%E8%AE%BE%E8%AE%A1/ 2.ZK实现:curator-recipes分布式锁的......

素雷 ⋅ 42分钟前 ⋅ 0

Sublime Text3 快捷键

选择类 Ctrl+D 选中光标所占的文本,继续操作则会选中下一个相同的文本。 Alt+F3 选中文本按下快捷键,即可一次性选择全部的相同文本进行同时编辑。举个栗子:快速选中并更改所有相同的变量名...

AndyZhouX ⋅ 48分钟前 ⋅ 0

XamarinAndroid组件教程RecylerView自定义适配器动画

XamarinAndroid组件教程RecylerView自定义适配器动画 如果RecyclerViewAnimators.Adapters命名空间中没有所需要的适配器动画,开发者可以自定义动画。此时,需要让自定义的动画继承Animation...

大学霸 ⋅ 49分钟前 ⋅ 0

eureka 基础(二)

使用Eureka服务器进行身份验证 如果其中一个eureka.client.serviceUrl.defaultZone网址中包含一个凭据(如http://user:password@localhost:8761/eureka)),HTTP基本身份验证将自动添加到您...

明理萝 ⋅ 52分钟前 ⋅ 1

Kubernetes(五) - Service

Kubernetes解决的另外一个痛点就是服务发现,服务发现机制和容器开放访问都是通过Service来实现的,把Deployment和Service关联起来只需要Label标签相同就可以关联起来形成负载均衡,基于kuberne...

喵了_个咪 ⋅ 52分钟前 ⋅ 0

更新队友POM文件后报错

打开报错的地方的pom及其引用方法所在文件的pom,观察其版本号是否一致,不一致进行更改

森火 ⋅ 今天 ⋅ 0

IDEA使用sonarLint

一、IDEA如何安装SonarLint插件 1.打开 Idea 2.点击【File】 3.点击【Settings】 4.点击【Plugins】 5.在搜索栏中输入“sonarlint”关键字 6.点击【Install】进行安装 7.重启Idea 二、IDEA如...

开源中国成都区源花 ⋅ 今天 ⋅ 0

没有更多内容

加载失败,请刷新页面

加载更多

下一页

返回顶部
顶部